BDBM50332477 4-(4-(2-(Dimethylamino)ethoxy)phenyl)-2-((6-methyl-2-oxo-2H-chromen-3-yl)-methyl)butanoic acid hydroxyamide::CHEMBL1630088
SMILES CN(C)CCOc1ccc(CCC(Cc2cc3cc(C)ccc3oc2=O)C(=O)NO)cc1
InChI Key InChIKey=WRLLSTLVYRVAEC-UHFFFAOYSA-N
Data  2 IC50
  Tab Delimited (TSV)   2D SDfile   Computed 3D by Vconf -m prep SDfile
Find this compound or compounds like it in BindingDB:
Activity Spreadsheet -- Enzyme Inhibition Constant Data from BindingDB
Found 2 hits for monomerid = 50332477
TargetDisintegrin and metalloproteinase domain-containing protein 17(Homo sapiens (Human))
Yonsei University
Curated by ChEMBL
LigandPNGBDBM50332477(4-(4-(2-(Dimethylamino)ethoxy)phenyl)-2-((6-methyl...)
Affinity DataIC50:  0.660nM. Assay description: Inhibition of human TACE by fluorescent spectroscopy
In DepthDetails ArticlePubMed
TargetDisintegrin and metalloproteinase domain-containing protein 17(Homo sapiens (Human))
Yonsei University
Curated by ChEMBL
LigandPNGBDBM50332477(4-(4-(2-(Dimethylamino)ethoxy)phenyl)-2-((6-methyl...)
Affinity DataIC50:  0.660nM. Assay description: Inhibition of human TACE by fluorescent spectroscopy
In DepthDetails ArticlePubMed