BDBM50332797 CHEMBL1629794::N-[2-(10H-Phenothiazin-10-yl)ethyl]-4-methylpiperazin-1-amine dihydrochloride
SMILES CN1CCN(CC1)NCCN1c2ccccc2Sc2ccccc12
InChI Key InChIKey=MWUAENAQTGSUCO-UHFFFAOYSA-N
Data  1 KI  3 IC50
  Tab Delimited (TSV)   2D SDfile   Computed 3D by Vconf -m prep SDfile
Find this compound or compounds like it in BindingDB:
Activity Spreadsheet -- Enzyme Inhibition Constant Data from BindingDB
Found 4 hits for monomerid = 50332797
TargetAlpha-synuclein(Homo sapiens (Human))
Washington University
Curated by ChEMBL
LigandPNGBDBM50332797(CHEMBL1629794 | N-[2-(10H-Phenothiazin-10-yl)ethyl...)
Affinity DataKi: >500nM. Assay description: Binding affinity to human alpha-synuclein expressed in Escherichia coli BL21 (DE3) cells after 1 hr by thioflavin T fluorescence assay
In DepthDetails ArticlePubMed
TargetAlpha-synuclein(Homo sapiens (Human))
Washington University
Curated by ChEMBL
LigandPNGBDBM50332797(CHEMBL1629794 | N-[2-(10H-Phenothiazin-10-yl)ethyl...)
Affinity DataIC50:  1.60E+4nM. Assay description: Binding affinity to human alpha-synuclein expressed in Escherichia coli BL21 (DE3) cells after 1 hr by thioflavin T fluorescence assay
In DepthDetails ArticlePubMed
TargetAcetylcholinesterase(Bos taurus (bovine))
Instituto De Qu£Mica M£Dica
Curated by ChEMBL
LigandPNGBDBM50332797(CHEMBL1629794 | N-[2-(10H-Phenothiazin-10-yl)ethyl...)
Affinity DataIC50: >1.00E+5nM. Assay description: Inhibition of bovine erythrocyte AChE by Ellman's method
In DepthDetails ArticlePubMed
TargetCholinesterase(Equus caballus (Horse))
Instituto De Qu£Mica M£Dica
Curated by ChEMBL
LigandPNGBDBM50332797(CHEMBL1629794 | N-[2-(10H-Phenothiazin-10-yl)ethyl...)
Affinity DataIC50:  5.00E+4nM. Assay description: Inhibition of equine serum BuChE by Ellman's method
In DepthDetails ArticlePubMed