BDBM50333000 4-(3-(2-methylpyridin-4-yl)phenyl)-8-(trifluoromethyl)-1H-benzo[b][1,4]diazepin-2(3H)-one::CHEMBL1629865
SMILES Cc1cc(ccn1)-c1cccc(c1)C1=Nc2ccc(cc2NC(=O)C1)C(F)(F)F
InChI Key InChIKey=DFWDFOZNVALGES-UHFFFAOYSA-N
Data  4 IC50
  Tab Delimited (TSV)   2D SDfile   Computed 3D by Vconf -m prep SDfile
Find this compound or compounds like it in BindingDB:
Activity Spreadsheet -- Enzyme Inhibition Constant Data from BindingDB
Found 4 hits for monomerid = 50333000
TargetMetabotropic glutamate receptor 3(Rattus norvegicus (Rat))
F. Hoffmann-La Roche
Curated by ChEMBL
LigandPNGBDBM50333000(4-(3-(2-methylpyridin-4-yl)phenyl)-8-(trifluoromet...)
Affinity DataIC50:  17nM. Assay description: Antagonist activity at rat mGluR3 receptor expressed in CHO cells assessed as inhibition of GIRK current
In DepthDetails ArticlePubMed
TargetMetabotropic glutamate receptor 2(Homo sapiens (Human))
F. Hoffmann-La Roche
Curated by ChEMBL
LigandPNGBDBM50333000(4-(3-(2-methylpyridin-4-yl)phenyl)-8-(trifluoromet...)
Affinity DataIC50:  36nM. Assay description: Antagonist activity at recombinant rat mGluR2 expressed in forskolin-stimulated CHO cells assessed as inhibition of (1S,3R)-ACPD induced cAMP product...
In DepthDetails ArticlePubMed
TargetMetabotropic glutamate receptor 2(Homo sapiens (Human))
F. Hoffmann-La Roche
Curated by ChEMBL
LigandPNGBDBM50333000(4-(3-(2-methylpyridin-4-yl)phenyl)-8-(trifluoromet...)
Affinity DataIC50:  25nM. Assay description: Antagonist activity at human mGluR2 receptor expressed in CHO cells assessed as inhibition of GIRK current
In DepthDetails ArticlePubMed
TargetMetabotropic glutamate receptor 2(Homo sapiens (Human))
F. Hoffmann-La Roche
Curated by ChEMBL
LigandPNGBDBM50333000(4-(3-(2-methylpyridin-4-yl)phenyl)-8-(trifluoromet...)
Affinity DataIC50:  18nM. Assay description: Partial displacement of [3H]LY354740 from recombinant rat mGluR2
In DepthDetails ArticlePubMed