BDBM50333270 4-(3-((4-(4,4-dimethylpent-1-en-2-yl)cyclohexyl)methyl)-2-methylenebut-3-enyl)-1,2-dimethylbenzene::CHEMBL1645122
SMILES CC(C)(C)OC(=O)N1CCC(CC1)NC(=O)C(=O)Nc1ccc(Cl)c(F)c1
InChI Key InChIKey=PPDMVLKBLMCDCE-UHFFFAOYSA-N
Data  1 IC50
  Tab Delimited (TSV)   2D SDfile   Computed 3D by Vconf -m prep SDfile
Find this compound or compounds like it in BindingDB:
Activity Spreadsheet -- Enzyme Inhibition Constant Data from BindingDB
Found 1 hit for monomerid = 50333270
TargetEnvelope glycoprotein gp160(Human immunodeficiency virus type 1 group M subtyp...)
Bryn Mawr College
Curated by ChEMBL
LigandPNGBDBM50333270(4-(3-((4-(4,4-dimethylpent-1-en-2-yl)cyclohexyl)me...)
Affinity DataIC50: >1.00E+5nM. Assay description: Inhibition of HIV1 YU2 gp120 binding to CD4 expressing Cf2Th-CD4/CCR5 cells assessed as inhibition of viral infection after 48 hrs
In DepthDetails ArticlePubMed