BDBM50333697 CHEMBL1643392::benzyl(S)-6-(hydroxyamino)-5-(3-((2S,3R)-1-(hydroxyamino)-3-methyl-1-oxopentan-2-yl)ureido)-6-oxohexylcarbamate
SMILES CC[C@@H](C)[C@H](NC(=O)N[C@@H](CCCCNC(=O)OCc1ccccc1)C(=O)NO)C(=O)NO
InChI Key InChIKey=KVKLXABZRCXDMI-PVAVHDDUSA-N
Data  1 IC50
  Tab Delimited (TSV)   2D SDfile   Computed 3D by Vconf -m prep SDfile
Find this compound or compounds like it in BindingDB:
Activity Spreadsheet -- Enzyme Inhibition Constant Data from BindingDB
Found 1 hit for monomerid = 50333697
TargetAminopeptidase N(Sus scrofa (Pig))
Shandong University
Curated by ChEMBL
LigandPNGBDBM50333697(CHEMBL1643392 | benzyl(S)-6-(hydroxyamino)-5-(3-((...)
Affinity DataIC50: >5.00E+4nMT: 2°C. Assay description: Inhibition of porcine kidney microsomal APN after 10 mins at room temperature by spectrophotometry
In DepthDetails ArticlePubMed