BDBM50333762 CHEMBL1644293::N1-(3,4-Dimethoxybenzyl)-N7-(1,2,3,4-tetrahydroacridin-9-yl)heptane-1,7-diamine
SMILES COc1ccc(CNCCCCCCCNc2c3CCCCc3nc3ccccc23)cc1OC
InChI Key InChIKey=DECRHYMHDWBJQW-UHFFFAOYSA-N
Data  2 IC50
  Tab Delimited (TSV)   2D SDfile   Computed 3D by Vconf -m prep SDfile
Find this compound or compounds like it in BindingDB:
Activity Spreadsheet -- Enzyme Inhibition Constant Data from BindingDB
Found 2 hits for monomerid = 50333762
TargetAcetylcholinesterase(Electrophorus electricus (Electric eel))
Sun Yat-Sen University
Curated by ChEMBL
LigandPNGBDBM50333762(CHEMBL1644293 | N1-(3,4-Dimethoxybenzyl)-N7-(1,2,3...)
Affinity DataIC50:  24.0nM. Assay description: Inhibition of electric eel AChE by Ellman's method
In DepthDetails ArticlePubMed
TargetCarboxylic ester hydrolase(Equus caballus (Horse))
Sun Yat-Sen University
Curated by ChEMBL
LigandPNGBDBM50333762(CHEMBL1644293 | N1-(3,4-Dimethoxybenzyl)-N7-(1,2,3...)
Affinity DataIC50:  5.51nM. Assay description: Inhibition of equine BChE by Ellman's method
In DepthDetails ArticlePubMed