BDBM50333765 CHEMBL1644290::N1-(1,2,3,4-Tetrahydroacridin-9-yl)-N8-(3,4,5-trimethoxybenzyl)octane-1,8-diamine
SMILES COc1cc(CNCCCCCCCCNc2c3CCCCc3nc3ccccc23)cc(OC)c1OC
InChI Key InChIKey=VJIYCNBLXVAUIX-UHFFFAOYSA-N
Data  2 IC50
  Tab Delimited (TSV)   2D SDfile   Computed 3D by Vconf -m prep SDfile
Find this compound or compounds like it in BindingDB:
Activity Spreadsheet -- Enzyme Inhibition Constant Data from BindingDB
Found 2 hits for monomerid = 50333765
TargetAcetylcholinesterase(Electrophorus electricus (Electric eel))
Sun Yat-Sen University
Curated by ChEMBL
LigandPNGBDBM50333765(CHEMBL1644290 | N1-(1,2,3,4-Tetrahydroacridin-9-yl...)
Affinity DataIC50:  9.77nM. Assay description: Inhibition of electric eel AChE by Ellman's method
In DepthDetails ArticlePubMed
TargetCarboxylic ester hydrolase(Equus caballus (Horse))
Sun Yat-Sen University
Curated by ChEMBL
LigandPNGBDBM50333765(CHEMBL1644290 | N1-(1,2,3,4-Tetrahydroacridin-9-yl...)
Affinity DataIC50:  3.38nM. Assay description: Inhibition of equine BChE by Ellman's method
In DepthDetails ArticlePubMed