BDBM50334090 CHEMBL1644801::N-Butyl-2-[5-chloro-2-(1-methyl-2-oxo-2,3,4,5-tetrahydro-1H-benzo[b]azepin-7-ylamino)-pyrimidin-4-ylamino]-benzamide
SMILES CCCCNC(=O)c1ccccc1Nc1nc(Nc2ccc3N(C)C(=O)CCCc3c2)ncc1Cl
InChI Key InChIKey=LNDWTKJDTCDSMV-UHFFFAOYSA-N
Data  2 IC50
  Tab Delimited (TSV)   2D SDfile   Computed 3D by Vconf -m prep SDfile
Find this compound or compounds like it in BindingDB:
Activity Spreadsheet -- Enzyme Inhibition Constant Data from BindingDB
Found 2 hits for monomerid = 50334090
TargetHepatocyte growth factor receptor(Homo sapiens (Human))
Cephalon
Curated by ChEMBL
LigandPNGBDBM50334090(CHEMBL1644801 | N-Butyl-2-[5-chloro-2-(1-methyl-2-...)
Affinity DataIC50:  161nM. Assay description: Inhibition of c-MetChecked by Author
In DepthDetails ArticlePubMed
TargetInsulin receptor(Homo sapiens (Human))
Cephalon
Curated by ChEMBL
LigandPNGBDBM50334090(CHEMBL1644801 | N-Butyl-2-[5-chloro-2-(1-methyl-2-...)
Affinity DataIC50:  34nM. Assay description: Inhibition of IR kinaseChecked by Author
In DepthDetails ArticlePubMed