BDBM50334506 3-(4-((5-(4-(methylsulfonyl)phenyl)-3-(4-(trifluoromethoxy)phenyl)-1H-pyrazol-1-yl)methyl)benzamido)propanoic acid::CHEMBL1644194
SMILES CS(=O)(=O)c1ccc(cc1)-c1cc(nn1Cc1ccc(cc1)C(=O)NCCC(O)=O)-c1ccc(OC(F)(F)F)cc1
InChI Key InChIKey=JLDQIPQTHIWMDE-UHFFFAOYSA-N
Data  1 IC50
  Tab Delimited (TSV)   2D SDfile   Computed 3D by Vconf -m prep SDfile
Find this compound or compounds like it in BindingDB:
Activity Spreadsheet -- Enzyme Inhibition Constant Data from BindingDB
Found 1 hit for monomerid = 50334506
TargetGlucagon receptor(Homo sapiens (Human))
Merck Research Laboratories
Curated by ChEMBL
LigandPNGBDBM50334506(3-(4-((5-(4-(methylsulfonyl)phenyl)-3-(4-(trifluor...)
Affinity DataIC50:  1.20E+3nM. Assay description: Displacement of [125I]glucagon from human GCGR expressed in CHO cells
In DepthDetails ArticlePubMed