BDBM50334527 1-benzyl-3-(3-fluorophenyl)-4,5,6,7-tetrahydro-1H-pyrrolo[3,2-c]pyridine::CHEMBL1644278
SMILES Fc1cccc(c1)-c1cn(Cc2ccccc2)c2CCNCc12
InChI Key InChIKey=VKWLWXLIJKLQTQ-UHFFFAOYSA-N
Data  1 KI
  Tab Delimited (TSV)   2D SDfile   Computed 3D by Vconf -m prep SDfile
Find this compound or compounds like it in BindingDB:
Activity Spreadsheet -- Enzyme Inhibition Constant Data from BindingDB
Found 1 hit for monomerid = 50334527
Target5-hydroxytryptamine receptor 7(Rattus norvegicus (rat))
Johnson & Johnson Pharmaceutical Research And Development
Curated by ChEMBL
LigandPNGBDBM50334527(1-benzyl-3-(3-fluorophenyl)-4,5,6,7-tetrahydro-1H-...)
Affinity DataKi:  2.73E+3nM. Assay description: Displacement of [3H]5-CT from rat recombinant 5HT7 receptor expressed in HEK293 cells after 60 mins
In DepthDetails ArticlePubMed