BDBM50334643 CHEMBL1642557::N-(2-(3-(5-(ethylamino)-8-methyl-8H-imidazo[4,5-d]thiazolo[5,4-b]pyridin-2-yl)phenyl)propan-2-yl)acetamide
SMILES CCNc1nc2sc(nc2c2n(C)cnc12)-c1cccc(c1)C(C)(C)NC(C)=O
InChI Key InChIKey=YGIHOHFWAITTCE-UHFFFAOYSA-N
Data  1 IC50
  Tab Delimited (TSV)   2D SDfile   Computed 3D by Vconf -m prep SDfile
Find this compound or compounds like it in BindingDB:
Activity Spreadsheet -- Enzyme Inhibition Constant Data from BindingDB
Found 1 hit for monomerid = 50334643
TargetInhibitor of nuclear factor kappa-B kinase subunit beta(Homo sapiens (Human))
Bristol-Myers Squibb
Curated by ChEMBL
LigandPNGBDBM50334643(CHEMBL1642557 | N-(2-(3-(5-(ethylamino)-8-methyl-8...)
Affinity DataIC50:  36nM. Assay description: Inhibition of IKK2
In DepthDetails ArticlePubMed