BDBM50334707 3-(4-Methoxy-benzenesulfonyl)-thiazolidine-2-carboxylic acid(5-carbamoyl-adamantan-2-yl)-amide::CHEMBL1642621
SMILES COc1ccc(cc1)S(=O)(=O)N1CCSC1C(=O)NC1C2CC3CC1CC(C3)(C2)C(N)=O
InChI Key InChIKey=GBYKIQMJPPNGRP-UHFFFAOYSA-N
Data  2 IC50
  Tab Delimited (TSV)   2D SDfile   Computed 3D by Vconf -m prep SDfile
Find this compound or compounds like it in BindingDB:
Activity Spreadsheet -- Enzyme Inhibition Constant Data from BindingDB
Found 2 hits for monomerid = 50334707
Target11-beta-hydroxysteroid dehydrogenase 1(Mus musculus (mouse))
Korea University
Curated by ChEMBL
LigandPNGBDBM50334707(3-(4-Methoxy-benzenesulfonyl)-thiazolidine-2-carbo...)
Affinity DataIC50:  57nM. Assay description: Inhibition of mouse 11beta-HSD1 expressed in CHO cells after 3 hrs by HTRF cortisol assay
In DepthDetails ArticlePubMed
Target11-beta-hydroxysteroid dehydrogenase 1(Homo sapiens (Human))
Korea University
Curated by ChEMBL
LigandPNGBDBM50334707(3-(4-Methoxy-benzenesulfonyl)-thiazolidine-2-carbo...)
Affinity DataIC50:  16nM. Assay description: Inhibition of human 11beta-HSD1 expressed in CHO cells after 3 hrs by HTRF cortisol assay
In DepthDetails ArticlePubMed