BDBM50334964 CHEMBL1649931::N-{(1S)-3-[3-endo-(5-Isobutyryl-2-methyl-4,5,6,7-tetrahydro-1H-imidazo[4,5-c]pyridin-1-yl)-8-azabicyclo[3.2.1]oct-8-yl]-1-(3-fluorophenyl)propyl}acetamide
SMILES CC(C)C(=O)N1CCc2c(C1)nc(C)n2[C@@H]1C[C@@H]2CC[C@H](C1)N2CC[C@H](NC(C)=O)c1cccc(F)c1
InChI Key InChIKey=QETUKYDWZIRTEI-QUMGSSFMSA-N
Data  1 IC50
  Tab Delimited (TSV)   2D SDfile   Computed 3D by Vconf -m prep SDfile
Find this compound or compounds like it in BindingDB:
Activity Spreadsheet -- Enzyme Inhibition Constant Data from BindingDB
Found 1 hit for monomerid = 50334964
TargetPotassium voltage-gated channel subfamily H member 2(Homo sapiens (Human))
Pfizer
Curated by ChEMBL
LigandPNGBDBM50334964(CHEMBL1649931 | N-{(1S)-3-[3-endo-(5-Isobutyryl-2-...)
Affinity DataIC50:  1.20E+4nM. Assay description: Displacement of [3H]-dofetilide from human ERG expressed in HEK293 cells
In DepthDetails ArticlePubMed