BDBM50335153 3-[5-(2-Difluoromethoxyphenyl)-1H-benzimidazol-2-yl]-1-oxa-2-aza-spiro[4.5]dec-2-ene::CHEMBL1650517
SMILES FC(F)Oc1ccccc1-c1ccc2nc([nH]c2c1)C1=NOC2(C1)CCCCC2
InChI Key InChIKey=DWNAAHJEEYOYCW-UHFFFAOYSA-N
Data  1 IC50
  Tab Delimited (TSV)   2D SDfile   Computed 3D by Vconf -m prep SDfile
Find this compound or compounds like it in BindingDB:
Activity Spreadsheet -- Enzyme Inhibition Constant Data from BindingDB
Found 1 hit for monomerid = 50335153
TargetTransient receptor potential M8 protein(Canis lupus familiaris (Dog))
Janssen Pharmaceutica
Curated by ChEMBL
LigandPNGBDBM50335153(3-[5-(2-Difluoromethoxyphenyl)-1H-benzimidazol-2-y...)
Affinity DataIC50:  2.5nM. Assay description: Antagonist activity at canine TRPM8 expressed in HEK293 cells assessed as inhibition of intracellular calcium accumulation by FLIPR assay
In DepthDetails ArticlePubMed