BDBM50335164 3-[5-(2-Chlorophenyl)-7-trifluoromethyl-1H-benzimidazol-2-yl]-1-oxa-2-aza-spiro[4.5]dec-2-ene::CHEMBL1650527
SMILES FC(F)(F)c1cc(cc2nc([nH]c12)C1=NOC2(C1)CCCCC2)-c1ccccc1Cl
InChI Key InChIKey=RFGUIBKXEBMLGQ-UHFFFAOYSA-N
Data  2 IC50
  Tab Delimited (TSV)   2D SDfile   Computed 3D by Vconf -m prep SDfile
Find this compound or compounds like it in BindingDB:
Activity Spreadsheet -- Enzyme Inhibition Constant Data from BindingDB
Found 2 hits for monomerid = 50335164
TargetTransient receptor potential M8 protein(Canis lupus familiaris (Dog))
Janssen Pharmaceutica
Curated by ChEMBL
LigandPNGBDBM50335164(3-[5-(2-Chlorophenyl)-7-trifluoromethyl-1H-benzimi...)
Affinity DataIC50:  1nM. Assay description: Antagonist activity at canine TRPM8 expressed in HEK293 cells assessed as inhibition of intracellular calcium accumulation by FLIPR assay
In DepthDetails ArticlePubMed
TargetCytochrome P450 2C9(Homo sapiens (Human))
Janssen Pharmaceutica
Curated by ChEMBL
LigandPNGBDBM50335164(3-[5-(2-Chlorophenyl)-7-trifluoromethyl-1H-benzimi...)
Affinity DataIC50:  1.00E+4nM. Assay description: Inhibition of CYP2C9 in human liver microsomes after 15 mis
In DepthDetails ArticlePubMed