BDBM50335185 CHEMBL1650542::N-(6-methyl-3-(1H-pyrazol-4-yl)imidazo[1,2-a]pyrazin-8-yl)-3-(pyrrolidin-1-ylmethyl)isothiazol-5-amine Hydrochloride
SMILES Cc1cn2c(cnc2c(Nc2cc(CN3CCCC3)ns2)n1)-c1cn[nH]c1
InChI Key InChIKey=ULZISYPWXIGTKR-UHFFFAOYSA-N
Data  1 IC50
  Tab Delimited (TSV)   2D SDfile   Computed 3D by Vconf -m prep SDfile
Find this compound or compounds like it in BindingDB:
Activity Spreadsheet -- Enzyme Inhibition Constant Data from BindingDB
Found 1 hit for monomerid = 50335185
TargetAurora kinase B(Homo sapiens (Human))
Merck Research Laboratories
Curated by ChEMBL
LigandPNGBDBM50335185(CHEMBL1650542 | N-(6-methyl-3-(1H-pyrazol-4-yl)imi...)
Affinity DataIC50:  88nM. Assay description: Inhibition of Aurora B in human HCT116 cells assessed as inhibition of histone H3 phosphorylation by immunofluorescence assay
In DepthDetails ArticlePubMed