BDBM50335264 CHEMBL1651230::N-methyl-2-(1-methyl-2-phenyl-1H-indol-3-yl)-2-oxo-N-pentylacetamide
SMILES CCCCCN(C)C(=O)C(=O)c1c(-c2ccccc2)n(C)c2ccccc12
InChI Key InChIKey=JWDUEFLRFMKAES-UHFFFAOYSA-N
Data  1 KI
  Tab Delimited (TSV)   2D SDfile   Computed 3D by Vconf -m prep SDfile
Find this compound or compounds like it in BindingDB:
Activity Spreadsheet -- Enzyme Inhibition Constant Data from BindingDB
Found 1 hit for monomerid = 50335264
TargetTranslocator protein(Rattus norvegicus (rat))
National Institute Of Mental Health
Curated by ChEMBL
LigandPNGBDBM50335264(CHEMBL1651230 | N-methyl-2-(1-methyl-2-phenyl-1H-i...)
Affinity DataKi:  38.2nM. Assay description: Displacement of [11C]PK11195 from TSPO in rat kidney mitochondrial membrane
In DepthDetails ArticlePubMed