BDBM50335333 4-(5-Methyl-1H-pyrazol-3-ylamino)-2-m-tolyl-2H-phthalazin-1-one::CHEMBL1651471
SMILES Cc1cc(Nc2nn(-c3cccc(C)c3)c(=O)c3ccccc23)[nH]n1
InChI Key InChIKey=SYVLQSPSGXPACG-UHFFFAOYSA-N
Data  2 IC50
  Tab Delimited (TSV)   2D SDfile   Computed 3D by Vconf -m prep SDfile
Find this compound or compounds like it in BindingDB:
Activity Spreadsheet -- Enzyme Inhibition Constant Data from BindingDB
Found 2 hits for monomerid = 50335333
TargetAurora kinase A(Homo sapiens (Human))
Evotec (Uk)
Curated by ChEMBL
LigandPNGBDBM50335333(4-(5-Methyl-1H-pyrazol-3-ylamino)-2-m-tolyl-2H-pht...)
Affinity DataIC50:  24nM. Assay description: Inhibition of Aurora A by ELISA
In DepthDetails ArticlePubMed
TargetAurora kinase B(Homo sapiens (Human))
Evotec (Uk)
Curated by ChEMBL
LigandPNGBDBM50335333(4-(5-Methyl-1H-pyrazol-3-ylamino)-2-m-tolyl-2H-pht...)
Affinity DataIC50: >1.00E+5nM. Assay description: Inhibition of Aurora B by ELISA
In DepthDetails ArticlePubMed