BDBM50335391 CHEMBL1651629::N-Pentoxypentyl-1-deoxynojirimycin
SMILES CCCCCOCCCCCN1C[C@H](O)[C@@H](O)[C@H](O)[C@H]1CO
InChI Key InChIKey=LLUQYJRYJAPGMA-QKPAOTATSA-N
Data  6 IC50
  Tab Delimited (TSV)   2D SDfile   Computed 3D by Vconf -m prep SDfile
Find this compound or compounds like it in BindingDB:
Activity Spreadsheet -- Enzyme Inhibition Constant Data from BindingDB
Found 6 hits for monomerid = 50335391
TargetLysosomal acid glucosylceramidase(Homo sapiens (Human))
TBA
Curated by ChEMBL
LigandPNGBDBM50335391(CHEMBL1651629 | N-Pentoxypentyl-1-deoxynojirimycin)
Affinity DataIC50:  7.05E+5nM. Assay description: Inhibition of recombinant GBA1 preincuabated with compound for 30 mins using 4-methylumbelliferyl-B-glucoside substrate by fluorimetric assay
In DepthDetails ArticlePubMed
TargetCeramide glucosyltransferase(Mus musculus)
TBA
Curated by ChEMBL
LigandPNGBDBM50335391(CHEMBL1651629 | N-Pentoxypentyl-1-deoxynojirimycin)
Affinity DataIC50:  2.00E+3nM. Assay description: Inhibition of glucosylceramide synthase in mouse RAW cells preincubated with compound for 15 mins by in-situ enzyme inhibition assay
In DepthDetails ArticlePubMed
TargetNon-lysosomal glucosylceramidase(Homo sapiens (Human))
TBA
Curated by ChEMBL
LigandPNGBDBM50335391(CHEMBL1651629 | N-Pentoxypentyl-1-deoxynojirimycin)
Affinity DataIC50:  40nM. Assay description: Inhibition of recombinant GBA2 preincuabated with compound for 30 mins using 4-methylumbelliferyl-B-glucoside substrate by fluorimetric assay
In DepthDetails ArticlePubMed
TargetBeta-galactosidase(Mus musculus)
TBA
Curated by ChEMBL
LigandPNGBDBM50335391(CHEMBL1651629 | N-Pentoxypentyl-1-deoxynojirimycin)
Affinity DataIC50:  3.00E+5nM. Assay description: Inhibition of lactase in mouse intestinal input by glucose release assay
In DepthDetails ArticlePubMed
TargetSucrase-isomaltase(Mus musculus)
TBA
Curated by ChEMBL
LigandPNGBDBM50335391(CHEMBL1651629 | N-Pentoxypentyl-1-deoxynojirimycin)
Affinity DataIC50:  1.20E+3nM. Assay description: Inhibition of sucrase in mouse intestinal input by glucose release assay
In DepthDetails ArticlePubMed
TargetLysosomal alpha-glucosidase(Mus musculus (Mouse))
TBA
Curated by ChEMBL
LigandPNGBDBM50335391(CHEMBL1651629 | N-Pentoxypentyl-1-deoxynojirimycin)
Affinity DataIC50:  4.00E+3nM. Assay description: Inhibition of maltase in mouse intestinal input by glucose release assay
In DepthDetails ArticlePubMed