BDBM50335420 2-(6-(ethyl(methyl)amino)-2-(pentylamino)-9H-purin-9-yl)acetic acid::CHEMBL1651660
SMILES CCCCCNc1nc(N(C)CC)c2ncn(CC(O)=O)c2n1
InChI Key InChIKey=HCVZDCXXDOXURI-UHFFFAOYSA-N
Data  1 IC50  1 Kd
  Tab Delimited (TSV)   2D SDfile   Computed 3D by Vconf -m prep SDfile
Find this compound or compounds like it in BindingDB:
Activity Spreadsheet -- Enzyme Inhibition Constant Data from BindingDB
Found 2 hits for monomerid = 50335420
TargetSignal transducer and activator of transcription 3(Mus musculus (mouse))
TBA
Curated by ChEMBL
LigandPNGBDBM50335420(2-(6-(ethyl(methyl)amino)-2-(pentylamino)-9H-purin...)
Affinity DataKd: >5.00E+4nM. Assay description: Binding affinity to mouse Stat3 by surface plasmon resonance assay
In DepthDetails ArticlePubMed
TargetSignal transducer and activator of transcription 3(Mus musculus (mouse))
TBA
Curated by ChEMBL
LigandPNGBDBM50335420(2-(6-(ethyl(methyl)amino)-2-(pentylamino)-9H-purin...)
Affinity DataIC50: >1.00E+5nM. Assay description: Inhibition of mouse Stat3 DNA binding activity by EMSA
In DepthDetails ArticlePubMed