BDBM50335433 2-(2-((4-cyclohexylbenzyl)amino)-6-((furan-2-ylmethyl)(methyl)amino)-9H-purin-9-yl)acetic acid::CHEMBL1651673
SMILES CN(Cc1ccco1)c1nc(NCc2ccc(cc2)C2CCCCC2)nc2n(CC(O)=O)cnc12
InChI Key InChIKey=ONSFKZUMGLNJOY-UHFFFAOYSA-N
Data  1 IC50  1 Kd
  Tab Delimited (TSV)   2D SDfile   Computed 3D by Vconf -m prep SDfile
Find this compound or compounds like it in BindingDB:
Activity Spreadsheet -- Enzyme Inhibition Constant Data from BindingDB
Found 2 hits for monomerid = 50335433
TargetSignal transducer and activator of transcription 3(Mus musculus (mouse))
TBA
Curated by ChEMBL
LigandPNGBDBM50335433(2-(2-((4-cyclohexylbenzyl)amino)-6-((furan-2-ylmet...)
Affinity DataKd:  1.12E+4nM. Assay description: Binding affinity to mouse Stat3 by surface plasmon resonance assay
In DepthDetails ArticlePubMed
TargetSignal transducer and activator of transcription 3(Mus musculus (mouse))
TBA
Curated by ChEMBL
LigandPNGBDBM50335433(2-(2-((4-cyclohexylbenzyl)amino)-6-((furan-2-ylmet...)
Affinity DataIC50: >1.00E+5nM. Assay description: Inhibition of mouse Stat3 DNA binding activity by EMSA
In DepthDetails ArticlePubMed