BDBM50335445 2-(2-((4-cyclohexylbenzyl)amino)-6-(4-fluorophenoxy)-9H-purin-9-yl)acetic acid::CHEMBL1651685
SMILES OC(=O)Cn1cnc2c(Oc3ccc(F)cc3)nc(NCc3ccc(cc3)C3CCCCC3)nc12
InChI Key InChIKey=ZVACWKIJINCDIT-UHFFFAOYSA-N
Data  1 IC50  1 Kd
  Tab Delimited (TSV)   2D SDfile   Computed 3D by Vconf -m prep SDfile
Find this compound or compounds like it in BindingDB:
Activity Spreadsheet -- Enzyme Inhibition Constant Data from BindingDB
Found 2 hits for monomerid = 50335445
TargetSignal transducer and activator of transcription 3(Mus musculus (mouse))
TBA
Curated by ChEMBL
LigandPNGBDBM50335445(2-(2-((4-cyclohexylbenzyl)amino)-6-(4-fluorophenox...)
Affinity DataIC50: >1.00E+5nM. Assay description: Inhibition of mouse Stat3 DNA binding activity by EMSA
In DepthDetails ArticlePubMed
TargetSignal transducer and activator of transcription 3(Mus musculus (mouse))
TBA
Curated by ChEMBL
LigandPNGBDBM50335445(2-(2-((4-cyclohexylbenzyl)amino)-6-(4-fluorophenox...)
Affinity DataKd:  800nM. Assay description: Binding affinity to mouse Stat3 by surface plasmon resonance assay
In DepthDetails ArticlePubMed