BDBM50335468 (R)-4-(3-(2-((1-(2-(4-((4-(1-acetyl-6-biphenyl-4-ylcarboxamido-2,2,4-trimethyl-1,2,3,4-tetrahydroquinolin-4-yl)phenoxy)methyl)-1H-1,2,3-triazol-1-yl)ethyl)-1H-1,2,3-triazol-4-yl)methylamino)-2-oxoethylamino)phenyl)-5-amino-N-tert-butyl-2-(methylthio)thieno[2,3-d]pyrimidine-6-carboxamide::CHEMBL1651723
SMILES CSc1nc(-c2cccc(NCC(=O)NCc3cn(CCn4cc(COc5ccc(cc5)[C@@]5(C)CC(C)(C)N(C(C)=O)c6ccc(NC(=O)c7ccc(cc7)-c7ccccc7)cc56)nn4)nn3)c2)c2c(N)c(sc2n1)C(=O)NC(C)(C)C
InChI Key InChIKey=ONPNZMGRFBOPLV-QRXDBQBNSA-N
Data  1 EC50
  Tab Delimited (TSV)   2D SDfile   Computed 3D by Vconf -m prep SDfile
Find this compound or compounds like it in BindingDB:
Activity Spreadsheet -- Enzyme Inhibition Constant Data from BindingDB
Found 1 hit for monomerid = 50335468
TargetLutropin-choriogonadotropic hormone receptor(Homo sapiens (Human))
TBA
Curated by ChEMBL
LigandPNGBDBM50335468((R)-4-(3-(2-((1-(2-(4-((4-(1-acetyl-6-biphenyl-4-y...)
Affinity DataEC50:  10nM. Assay description: Agonist activity at human LH receptor expressed in CHO-K1 cells assessed as stimulation of luciferase activity by CRE-driven luciferase reporter gene...
In DepthDetails ArticlePubMed