BDBM50335547 7-ethoxy-4-methyl-N-(4,4,6-trimethyl-4,5-dihydropyrimidin-2-yl)quinazolin-2-amine::CHEMBL1652423
SMILES CCOc1ccc2c(C)nc(NC3=NC(C)(C)CC(C)=N3)nc2c1
InChI Key InChIKey=SZAHGHHHEULPED-UHFFFAOYSA-N
Data  1 IC50
  Tab Delimited (TSV)   2D SDfile   Computed 3D by Vconf -m prep SDfile
Find this compound or compounds like it in BindingDB:
Activity Spreadsheet -- Enzyme Inhibition Constant Data from BindingDB
Found 1 hit for monomerid = 50335547
TargetTrypanothione reductase(Trypanosoma cruzi)
Monash University (Parkville Campus)
Curated by ChEMBL
LigandPNGBDBM50335547(7-ethoxy-4-methyl-N-(4,4,6-trimethyl-4,5-dihydropy...)
Affinity DataIC50:  2.80E+4nM. Assay description: Inhibition of Trypanosoma cruzi X10/1 trypanothione reductase assessed as inhibition of thionitrobenzoate formation by microplate reader analysis
In DepthDetails ArticlePubMed