BDBM50335552 1-(4-methylquinazolin-2-yl)guanidine::CHEMBL602365::GNF-Pf-3515
SMILES [#6]-c1nc(\[#7]=[#6](/[#7])-[#7])nc2ccccc12
InChI Key InChIKey=ONQKSKDLYYDFLL-UHFFFAOYSA-N
Data  1 IC50
  Tab Delimited (TSV)   2D SDfile   Computed 3D by Vconf -m prep SDfile
Find this compound or compounds like it in BindingDB:
Activity Spreadsheet -- Enzyme Inhibition Constant Data from BindingDB
Found 1 hit for monomerid = 50335552
TargetTrypanothione reductase(Trypanosoma cruzi)
Monash University (Parkville Campus)
Curated by ChEMBL
LigandPNGBDBM50335552(1-(4-methylquinazolin-2-yl)guanidine | CHEMBL60236...)
Affinity DataIC50: >1.00E+5nM. Assay description: Inhibition of Trypanosoma cruzi X10/1 trypanothione reductase assessed as inhibition of thionitrobenzoate formation by microplate reader analysis
In DepthDetails ArticlePubMed