BDBM50335599 CHEMBL1651091::pulicatins F
SMILES NC(=O)c1csc(n1)-c1ccccc1O
InChI Key InChIKey=AETDFAXPCFASDB-UHFFFAOYSA-N
Data  11 KI
  Tab Delimited (TSV)   2D SDfile   Computed 3D by Vconf -m prep SDfile
Find this compound or compounds like it in BindingDB:
Activity Spreadsheet -- Enzyme Inhibition Constant Data from BindingDB
Found 11 hits for monomerid = 50335599
Target5-hydroxytryptamine receptor 2B(Homo sapiens (Human))
University Of The Philippines
Curated by ChEMBL
LigandPNGBDBM50335599(CHEMBL1651091 | pulicatins F)
Affinity DataKi:  1.00E+3nM. Assay description: Displacement of [3H]-LSD from human 5-HT2B receptor expressed in baculovirus infected Sf9 cells
In DepthDetails ArticlePubMed
Target5-hydroxytryptamine receptor 2B(Homo sapiens (Human))
University Of The Philippines
Curated by ChEMBL
LigandPNGBDBM50335599(CHEMBL1651091 | pulicatins F)
Affinity DataKi:  1.03E+3nM. Assay description: Binding affinity to human 5HT2B receptor by radioligand displacement assay
In DepthDetails ArticlePubMed
Target5-hydroxytryptamine receptor 2A(Homo sapiens (Human))
University Of The Philippines
Curated by ChEMBL
LigandPNGBDBM50335599(CHEMBL1651091 | pulicatins F)
Affinity DataKi: >1.00E+4nM. Assay description: Binding affinity to 5-HT2A receptor (unknown origin) by radioligand binding assay
In DepthDetails ArticlePubMed
Target5-hydroxytryptamine receptor 2C(Homo sapiens (Human))
University Of The Philippines
Curated by ChEMBL
LigandPNGBDBM50335599(CHEMBL1651091 | pulicatins F)
Affinity DataKi: >1.00E+4nM. Assay description: Binding affinity to 5-HT2C receptor (unknown origin) by radioligand binding assay
In DepthDetails ArticlePubMed
Target5-hydroxytryptamine receptor 6(Homo sapiens (Human))
University Of The Philippines
Curated by ChEMBL
LigandPNGBDBM50335599(CHEMBL1651091 | pulicatins F)
Affinity DataKi: >1.00E+4nM. Assay description: Binding affinity to 5-HT6 receptor (unknown origin) by radioligand binding assay
In DepthDetails ArticlePubMed
Target5-hydroxytryptamine receptor 7(Homo sapiens (Human))
University Of The Philippines
Curated by ChEMBL
LigandPNGBDBM50335599(CHEMBL1651091 | pulicatins F)
Affinity DataKi: >1.00E+4nM. Assay description: Binding affinity to 5-HT7A receptor (unknown origin) by radioligand binding assay
In DepthDetails ArticlePubMed
Target5-hydroxytryptamine receptor 1E(Homo sapiens (Human))
University Of The Philippines
Curated by ChEMBL
LigandPNGBDBM50335599(CHEMBL1651091 | pulicatins F)
Affinity DataKi: >1.00E+4nM. Assay description: Binding affinity to 5-HT1E receptor (unknown origin) by radioligand binding assay
In DepthDetails ArticlePubMed
Target5-hydroxytryptamine receptor 1D(Homo sapiens (Human))
University Of The Philippines
Curated by ChEMBL
LigandPNGBDBM50335599(CHEMBL1651091 | pulicatins F)
Affinity DataKi: >1.00E+4nM. Assay description: Binding affinity to 5-HT1D receptor (unknown origin) by radioligand binding assay
In DepthDetails ArticlePubMed
Target5-hydroxytryptamine receptor 1B(Homo sapiens (Human))
University Of The Philippines
Curated by ChEMBL
LigandPNGBDBM50335599(CHEMBL1651091 | pulicatins F)
Affinity DataKi: >1.00E+4nM. Assay description: Displacement of [3H]-LSD from human 5-HT1B receptor expressed in baculovirus infected Sf9 cells
In DepthDetails ArticlePubMed
Target5-hydroxytryptamine receptor 5A(Homo sapiens (Human))
University Of The Philippines
Curated by ChEMBL
LigandPNGBDBM50335599(CHEMBL1651091 | pulicatins F)
Affinity DataKi: >1.00E+4nM. Assay description: Binding affinity to 5-HT5A receptor (unknown origin) by radioligand binding assay
In DepthDetails ArticlePubMed
Target5-hydroxytryptamine receptor 3A(Homo sapiens (Human))
University Of The Philippines
Curated by ChEMBL
LigandPNGBDBM50335599(CHEMBL1651091 | pulicatins F)
Affinity DataKi: >1.00E+4nM. Assay description: Binding affinity to 5-HT3 receptor (unknown origin) by radioligand binding assay
In DepthDetails ArticlePubMed