BDBM50335758 2-((2-(3-(R)-Aminopiperidin-1-yl)-6-oxo-5-(pyrrolidin-1-yl)pyrimidin-1(6H)-yl)methyl)benzonitrile::CHEMBL1650421
SMILES N[C@@H]1CCCN(C1)c1ncc(N2CCCC2)c(=O)n1Cc1ccccc1C#N
InChI Key InChIKey=GDMICCUHBLFSFE-GOSISDBHSA-N
Data  1 IC50
  Tab Delimited (TSV)   2D SDfile   Computed 3D by Vconf -m prep SDfile
Find this compound or compounds like it in BindingDB:
Activity Spreadsheet -- Enzyme Inhibition Constant Data from BindingDB
Found 1 hit for monomerid = 50335758
TargetDipeptidyl peptidase 4(Homo sapiens (Human))
Takeda California
Curated by ChEMBL
LigandPNGBDBM50335758(2-((2-(3-(R)-Aminopiperidin-1-yl)-6-oxo-5-(pyrroli...)
Affinity DataIC50:  200nM. Assay description: Inhibition of human DPP4
In DepthDetails ArticlePubMed