BDBM50335872 3-(1-(4-(6-fluorobenzo[d]thiazol-2-ylamino)-4-oxobutyl)-1H-1,2,3-triazol-4-yl)-6-hydroxy-2-meta-tolylbenzofuran-5-carboxylic acid::CHEMBL1650895
SMILES Cc1cccc(c1)-c1oc2cc(O)c(cc2c1-c1cn(CCCC(=O)Nc2nc3ccc(F)cc3s2)nn1)C(O)=O
InChI Key InChIKey=JWWWRDDHQLZPOL-UHFFFAOYSA-N
Data  1 IC50
  Tab Delimited (TSV)   2D SDfile   Computed 3D by Vconf -m prep SDfile
Find this compound or compounds like it in BindingDB:
Activity Spreadsheet -- Enzyme Inhibition Constant Data from BindingDB
Found 1 hit for monomerid = 50335872
TargetTyrosine-protein phosphatase non-receptor type 22(Homo sapiens (Human))
Sanford-Burnham Medical Research Institute
Curated by ChEMBL
LigandPNGBDBM50335872(3-(1-(4-(6-fluorobenzo[d]thiazol-2-ylamino)-4-oxob...)
Affinity DataIC50:  610nM. Assay description: Inhibition of recombinant LyP assessed as hydrolysis of DiFMUP
In DepthDetails ArticlePubMed