BDBM50335991 CHEMBL1669007::N-(1-(4-(4,9-diethoxy-1-oxo-1H-benzo[f]isoindol-2(3H)-yl)-3-methylbenzyl)cyclopropylcarbamoyl)naphthalene-2-sulfonamide
SMILES CCOc1c2CN(C(=O)c2c(OCC)c2ccccc12)c1ccc(CC2(CC2)NC(=O)NS(=O)(=O)c2ccc3ccccc3c2)cc1C
InChI Key InChIKey=IZGHIQSBSUJNDS-UHFFFAOYSA-N
Data  2 KI  2 IC50
  Tab Delimited (TSV)   2D SDfile   Computed 3D by Vconf -m prep SDfile
Find this compound or compounds like it in BindingDB:
Activity Spreadsheet -- Enzyme Inhibition Constant Data from BindingDB
Found 4 hits for monomerid = 50335991
TargetProstaglandin E2 receptor EP4 subtype(Homo sapiens (Human))
Merck Frosst Centre For Therapeutic Research
Curated by ChEMBL
LigandPNGBDBM50335991(CHEMBL1669007 | N-(1-(4-(4,9-diethoxy-1-oxo-1H-ben...)
Affinity DataKi:  0.520nM. Assay description: Antagonist activity at human EP4 receptor expressed in HEK293 cells assessed as PGE2-induced cAMP accumulation by scintillation proximity assay
In DepthDetails ArticlePubMed
TargetProstaglandin E2 receptor EP4 subtype(Homo sapiens (Human))
Merck Frosst Centre For Therapeutic Research
Curated by ChEMBL
LigandPNGBDBM50335991(CHEMBL1669007 | N-(1-(4-(4,9-diethoxy-1-oxo-1H-ben...)
Affinity DataKi:  6.30nM. Assay description: Antagonist activity at human EP4 receptor expressed in HEK293 cells assessed as PGE2-induced cAMP accumulation by scintillation proximity assay in pr...
In DepthDetails ArticlePubMed
TargetProstaglandin E2 receptor EP4 subtype(Homo sapiens (Human))
Merck Frosst Centre For Therapeutic Research
Curated by ChEMBL
LigandPNGBDBM50335991(CHEMBL1669007 | N-(1-(4-(4,9-diethoxy-1-oxo-1H-ben...)
Affinity DataIC50:  2.5nM. Assay description: Displacement of [3H]PGE2 from human EP4 receptor expressed in HEK293 cells by scintillation counting
In DepthDetails ArticlePubMed
TargetProstaglandin E2 receptor EP4 subtype(Homo sapiens (Human))
Merck Frosst Centre For Therapeutic Research
Curated by ChEMBL
LigandPNGBDBM50335991(CHEMBL1669007 | N-(1-(4-(4,9-diethoxy-1-oxo-1H-ben...)
Affinity DataIC50:  37nM. Assay description: Displacement of [3H]PGE2 from human EP4 receptor expressed in HEK293 cells by scintillation counting in presence of 10% human serum
In DepthDetails ArticlePubMed