BDBM50336005 6-chloro-8-(4-(methylsulfonyl)phenyl)-2-(trifluoromethyl)-2H-chromene-3-carboxylic acid::CHEMBL1669027
SMILES CS(=O)(=O)c1ccc(cc1)-c1cc(Cl)cc2C=C(C(Oc12)C(F)(F)F)C(O)=O
InChI Key InChIKey=DWSOSXURKHROCG-UHFFFAOYSA-N
Data  2 IC50
  Tab Delimited (TSV)   2D SDfile   Computed 3D by Vconf -m prep SDfile
Find this compound or compounds like it in BindingDB:
Activity Spreadsheet -- Enzyme Inhibition Constant Data from BindingDB
Found 2 hits for monomerid = 50336005
TargetProstaglandin G/H synthase 2(Homo sapiens (Human))
Pfizer
Curated by ChEMBL
LigandPNGBDBM50336005(6-chloro-8-(4-(methylsulfonyl)phenyl)-2-(trifluoro...)
Affinity DataIC50:  2.13E+4nM. Assay description: Inhibition of human COX2
In DepthDetails ArticlePubMed
TargetProstaglandin G/H synthase 1(Homo sapiens (Human))
Pfizer
Curated by ChEMBL
LigandPNGBDBM50336005(6-chloro-8-(4-(methylsulfonyl)phenyl)-2-(trifluoro...)
Affinity DataIC50:  3.87E+3nM. Assay description: Inhibition of human COX1
In DepthDetails ArticlePubMed