BDBM50336144 (1R,3S)-4-chloro-N-(3-hydroxycyclohexyl)-5-(4-(trifluoromethyl)phenyl)isoxazole-3-carboxamide::CHEMBL1669532
SMILES O[C@H]1CCC[C@H](C1)NC(=O)c1noc(c1Cl)-c1ccc(cc1)C(F)(F)F
InChI Key InChIKey=ZMKULNNAJKQJNK-NEPJUHHUSA-N
Data  2 IC50
  Tab Delimited (TSV)   2D SDfile   Computed 3D by Vconf -m prep SDfile
Find this compound or compounds like it in BindingDB:
Activity Spreadsheet -- Enzyme Inhibition Constant Data from BindingDB
Found 2 hits for monomerid = 50336144
TargetTransient receptor potential cation channel subfamily V member 1(Homo sapiens (Human))
Merck Research Laboratories
Curated by ChEMBL
LigandPNGBDBM50336144((1R,3S)-4-chloro-N-(3-hydroxycyclohexyl)-5-(4-(tri...)
Affinity DataIC50:  0.501nM. Assay description: Antagonist activity at human TRPV1 expressed in CHO cells assessed as inhibition of calcium flux by FLIPR assay
In DepthDetails ArticlePubMed
TargetTransient receptor potential cation channel subfamily V member 1(Homo sapiens (Human))
Merck Research Laboratories
Curated by ChEMBL
LigandPNGBDBM50336144((1R,3S)-4-chloro-N-(3-hydroxycyclohexyl)-5-(4-(tri...)
Affinity DataIC50:  3nM. Assay description: Antagonist activity at human TRPV1 expressed in CHO cells assessed as inhibition of capsaicin-induced calcium influx by fluorimetric assay
In DepthDetails ArticlePubMed