BDBM50336164 8-(5-chloro-2-(4-methylpiperazin-1-yl)isonicotinamido)-1-(3-fluorophenyl)-4,5-dihydro-1H-benzo[g]indazole-3-carboxamide::CHEMBL1669556
SMILES CN1CCN(CC1)c1cc(C(=O)Nc2ccc3CCc4c(nn(c4-c3c2)-c2cccc(F)c2)C(N)=O)c(Cl)cn1
InChI Key InChIKey=ZOVDJSBYZCCKTL-UHFFFAOYSA-N
Data  1 IC50
  Tab Delimited (TSV)   2D SDfile   Computed 3D by Vconf -m prep SDfile
Find this compound or compounds like it in BindingDB:
Activity Spreadsheet -- Enzyme Inhibition Constant Data from BindingDB
Found 1 hit for monomerid = 50336164
TargetInhibitor of nuclear factor kappa-B kinase subunit beta(Homo sapiens (Human))
Pfizer
Curated by ChEMBL
LigandPNGBDBM50336164(8-(5-chloro-2-(4-methylpiperazin-1-yl)isonicotinam...)
Affinity DataIC50:  4.80nM. Assay description: Inhibition of human recombinant IKK2 in human PBMC
In DepthDetails ArticlePubMed