BDBM50336195 7.12.6. 8-({5-Chloro-2-[4-({1-[2-(isopropylamino)-2-oxoethyl]-1H-pyrazol-4-yl}methyl)piperazin-1-yl]isonicotinoyl}amino)-1-(4-fluorophenyl)-4,5-dihydro-1H-benzo[g]indazole-3-carboxamide::CHEMBL1669601
SMILES CC(C)NC(=O)Cn1cc(CN2CCN(CC2)c2cc(C(=O)Nc3ccc4CCc5c(nn(c5-c4c3)-c3ccc(F)cc3)C(N)=O)c(Cl)cn2)cn1
InChI Key InChIKey=CHDZQVKEMRHNOW-UHFFFAOYSA-N
Data  1 IC50
  Tab Delimited (TSV)   2D SDfile   Computed 3D by Vconf -m prep SDfile
Find this compound or compounds like it in BindingDB:
Activity Spreadsheet -- Enzyme Inhibition Constant Data from BindingDB
Found 1 hit for monomerid = 50336195
TargetInhibitor of nuclear factor kappa-B kinase subunit beta(Homo sapiens (Human))
Pfizer
Curated by ChEMBL
LigandPNGBDBM50336195(7.12.6. 8-({5-Chloro-2-[4-({1-[2-(isopropylamino)-...)
Affinity DataIC50:  2nM. Assay description: Inhibition of human recombinant IKK2 in human PBMC
In DepthDetails ArticlePubMed