BDBM50336364 4-Hydroxybenzyl gallate::CHEMBL1668052
SMILES Oc1ccc(COC(=O)c2cc(O)c(O)c(O)c2)cc1
InChI Key InChIKey=OQFLYAGQYRQJJD-UHFFFAOYSA-N
Data  1 IC50
  Tab Delimited (TSV)   2D SDfile   Computed 3D by Vconf -m prep SDfile
Find this compound or compounds like it in BindingDB:
Activity Spreadsheet -- Enzyme Inhibition Constant Data from BindingDB
Found 1 hit for monomerid = 50336364
TargetPolyphenol oxidase 2(Agaricus bisporus (Common mushroom))
Sun Yat-Sen University
Curated by ChEMBL
LigandPNGBDBM50336364(4-Hydroxybenzyl gallate | CHEMBL1668052)
Affinity DataIC50:  2.57E+4nM. Assay description: Inhibition of mushroom tyrosinase preincubated for 20 mins
In DepthDetails ArticlePubMed