BDBM50336587 3-(4-N,N-dimethylaminophenylthio)-8-oxo-8H-acenaphtho[1,2-b]pyrrole-9-carbonitrile::CHEMBL1672079
SMILES CN(C)c1ccc(Sc2ccc3c4c(C#N)c(=O)nc4c4cccc2c34)cc1
InChI Key InChIKey=XVVZVKUEVUGNGO-UHFFFAOYSA-N
Data  1 KI
  Tab Delimited (TSV)   2D SDfile   Computed 3D by Vconf -m prep SDfile
Find this compound or compounds like it in BindingDB:
Activity Spreadsheet -- Enzyme Inhibition Constant Data from BindingDB
Found 1 hit for monomerid = 50336587
TargetInduced myeloid leukemia cell differentiation protein Mcl-1(Homo sapiens (Human))
Dalian University Of Technology
Curated by ChEMBL
LigandPNGBDBM50336587(3-(4-N,N-dimethylaminophenylthio)-8-oxo-8H-acenaph...)
Affinity DataKi:  91nM. Assay description: Displacement of FAM-Bid from human Mcl-1 after 30 mins by fluorescence polarization assay
In DepthDetails ArticlePubMed