BDBM50336660 6-[4-({[3-(2,6-Dichlorophenyl)-5-(1-methylethyl)-4-isoxazolyl]methyl}oxy)phenyl]-4-[(1-methylethyl)oxy]-2-quinolinecarboxylic acid::CHEMBL1672465
SMILES CC(C)Oc1cc(nc2ccc(cc12)-c1ccc(OCc2c(noc2C(C)C)-c2c(Cl)cccc2Cl)cc1)C(O)=O
InChI Key InChIKey=PNXDDOFPVCLYFZ-UHFFFAOYSA-N
Data  2 EC50
  Tab Delimited (TSV)   2D SDfile   Computed 3D by Vconf -m prep SDfile
Find this compound or compounds like it in BindingDB:
Activity Spreadsheet -- Enzyme Inhibition Constant Data from BindingDB
Found 2 hits for monomerid = 50336660
TargetBile acid receptor(Homo sapiens (Human))
Glaxosmithkline
Curated by ChEMBL
LigandPNGBDBM50336660(6-[4-({[3-(2,6-Dichlorophenyl)-5-(1-methylethyl)-4...)
Affinity DataEC50:  14nM. Assay description: Agonist activity at human FXR LBD iexpressed in monkey CV-1 cells assessed as transactivation of luciferase reporter gene expression
In DepthDetails ArticlePubMed
TargetBile acid receptor(Homo sapiens (Human))
Glaxosmithkline
Curated by ChEMBL
LigandPNGBDBM50336660(6-[4-({[3-(2,6-Dichlorophenyl)-5-(1-methylethyl)-4...)
Affinity DataEC50:  40nM. Assay description: Agonist activity at human FXR LBD assessed as SRC1 peptide recruitment by FRET assay
In DepthDetails ArticlePubMed