BDBM50336695 3-Benzo[1,3]dioxol-5-yl-4-{3-[1-(2-{2-[2-(2-fluoroethoxy)ethoxy]-ethoxy}ethyl)-1H-1,2,3-triazol-4-ylmethoxy]-4,5-dimethoxybenzyl}-5-hydroxy-5-(4-methoxyphenyl)-5H-furan-2-one::CHEMBL1672881
SMILES COc1ccc(cc1)C1(O)OC(=O)C(=C1Cc1cc(OC)c(OC)c(OCc2cn(CCOCCOCCOCCF)nn2)c1)c1ccc2OCOc2c1
InChI Key InChIKey=MNTUQBKGVBUMOH-UHFFFAOYSA-N
Data  2 KI
  Tab Delimited (TSV)   2D SDfile   Computed 3D by Vconf -m prep SDfile
Find this compound or compounds like it in BindingDB:
Activity Spreadsheet -- Enzyme Inhibition Constant Data from BindingDB
Found 2 hits for monomerid = 50336695
TargetEndothelin-1 receptor(Mus musculus)
University Hospital Mu£Nster
Curated by ChEMBL
LigandPNGBDBM50336695(3-Benzo[1,3]dioxol-5-yl-4-{3-[1-(2-{2-[2-(2-fluoro...)
Affinity DataKi:  2.40nM. Assay description: Displacement of [125I]ET1 from ETA receptor in CD1 Nu/Nu mouse myocardial ventricles membranes after 2 hrs by gamma counting
In DepthDetails ArticlePubMed
TargetEndothelin receptor type B(Mus musculus)
University Hospital Mu£Nster
Curated by ChEMBL
LigandPNGBDBM50336695(3-Benzo[1,3]dioxol-5-yl-4-{3-[1-(2-{2-[2-(2-fluoro...)
Affinity DataKi:  8.45E+3nM. Assay description: Displacement of [125I]ET1 from ETB receptor in CD1 Nu/Nu mouse myocardial ventricles membranes after 2 hrs by gamma counting
In DepthDetails ArticlePubMed