BDBM50336792 CHEMBL256688::sodium 1-amino-4-(2,4-dimethylphenylamino)-9,10-dioxo-9,10-dihydroanthracene-2-sulfonate
SMILES Cc1ccc(Nc2cc(c(N)c3C(=O)c4ccccc4C(=O)c23)S([O-])(=O)=O)c(C)c1
InChI Key InChIKey=FYTJTDPRQJFSHH-UHFFFAOYSA-M
Data  5 IC50
  Tab Delimited (TSV)   2D SDfile   Computed 3D by Vconf -m prep SDfile
Find this compound or compounds like it in BindingDB:
Activity Spreadsheet -- Enzyme Inhibition Constant Data from BindingDB
Found 5 hits for monomerid = 50336792
TargetP2Y purinoceptor 2(Mus musculus)
University Of Bonn
Curated by ChEMBL
LigandPNGBDBM50336792(CHEMBL256688 | sodium 1-amino-4-(2,4-dimethylpheny...)
Affinity DataIC50:  9.00E+3nM. Assay description: Antagonist activity at mouse P2Y2 receptor in mouse NG108-15 cells assessed as inhibition of UTP-induced calcium mobilization
In DepthDetails ArticlePubMed
TargetP2Y purinoceptor 2(Homo sapiens (Human))
University Of Bonn
Curated by ChEMBL
LigandPNGBDBM50336792(CHEMBL256688 | sodium 1-amino-4-(2,4-dimethylpheny...)
Affinity DataIC50:  5.43E+3nM. Assay description: Antagonist activity at human recombinant P2Y2 receptor in 1321N1 cells assessed as inhibition of UTP-induced calcium mobilization
In DepthDetails ArticlePubMed
TargetP2Y purinoceptor 4(Homo sapiens (Human))
University Of Bonn
Curated by ChEMBL
LigandPNGBDBM50336792(CHEMBL256688 | sodium 1-amino-4-(2,4-dimethylpheny...)
Affinity DataIC50:  3.58E+3nM. Assay description: Antagonist activity at human P2Y4 receptor transfected in human 1321N1 cells assessed as inhibition of UTP-activated intracellular calcium mobilizati...
In DepthDetails ArticlePubMed
TargetP2X purinoceptor 4(RAT)
University Of Bonn
Curated by ChEMBL
LigandPNGBDBM50336792(CHEMBL256688 | sodium 1-amino-4-(2,4-dimethylpheny...)
Affinity DataIC50: >1.00E+4nM. Assay description: Antagonist activity against rat P2X4 receptor expressed in Xenopus laevis oocyte assessed as inhibition of alpha, beta-meATP-induced inward current b...
In DepthDetails ArticlePubMed
TargetP2X purinoceptor 2(RAT)
University Of Bonn
Curated by ChEMBL
LigandPNGBDBM50336792(CHEMBL256688 | sodium 1-amino-4-(2,4-dimethylpheny...)
Affinity DataIC50:  1.00E+3nM. Assay description: Antagonist activity against rat P2X2 receptor expressed in Xenopus laevis oocyte assessed as inhibition of alpha, beta-meATP-induced inward current b...
In DepthDetails ArticlePubMed