BDBM50336881 2-morpholino-N6-(6-phenoxypyridin-3-yl)-4,5'-bipyrimidine-2',6-diamine::CHEMBL1672326
SMILES Nc1ncc(cn1)-c1cc(Nc2ccc(Oc3ccccc3)nc2)nc(n1)N1CCOCC1
InChI Key InChIKey=JCCMMGYLXXXXQO-UHFFFAOYSA-N
Data  1 EC50
  Tab Delimited (TSV)   2D SDfile   Computed 3D by Vconf -m prep SDfile
Find this compound or compounds like it in BindingDB:
Activity Spreadsheet -- Enzyme Inhibition Constant Data from BindingDB
Found 1 hit for monomerid = 50336881
LigandPNGBDBM50336881(2-morpholino-N6-(6-phenoxypyridin-3-yl)-4,5'-bipyr...)
Affinity DataEC50:  110nM. Assay description: Inhibition of PI3Kalpha-mediated Akt phosphorylation at Ser473 in human A2780 cells after 1 hr
In DepthDetails ArticlePubMed