BDBM50336908 (+/-)-2-(Benzhydrylsulfinyl)-N-(3-phenylpropyl)acetamide::CHEMBL1672372
SMILES O=C(CS(=O)C(c1ccccc1)c1ccccc1)NCCCc1ccccc1
InChI Key InChIKey=BHLUMSGEGLIFRF-UHFFFAOYSA-N
Data  1 KI
  Tab Delimited (TSV)   2D SDfile   Computed 3D by Vconf -m prep SDfile
Find this compound or compounds like it in BindingDB:
Activity Spreadsheet -- Enzyme Inhibition Constant Data from BindingDB
Found 1 hit for monomerid = 50336908
TargetSodium-dependent dopamine transporter(Rattus norvegicus (rat))
National Institute On Drug Abuse-Intramural Research Program
Curated by ChEMBL
LigandPNGBDBM50336908((+/-)-2-(Benzhydrylsulfinyl)-N-(3-phenylpropyl)ace...)
Affinity DataKi:  2.66E+3nM. Assay description: Displacement of [3H]WIN35428 from DAT in Sprague-Dawley rat brain membranes
In DepthDetails ArticlePubMed