BDBM50337100 (S)-1-(2-[(Phenylsulfonyl)amino]benzamido)ethaneboronic acid::CHEMBL1672908
SMILES C[C@@H](NC(=O)c1ccccc1NS(=O)(=O)c1ccccc1)B(O)O
InChI Key InChIKey=ROGHUUNITXABDZ-LLVKDONJSA-N
Data  1 IC50
  Tab Delimited (TSV)   2D SDfile   Computed 3D by Vconf -m prep SDfile
Find this compound or compounds like it in BindingDB:
Activity Spreadsheet -- Enzyme Inhibition Constant Data from BindingDB
Found 1 hit for monomerid = 50337100
TargetD-alanyl-D-alanine carboxypeptidase(Actinomadura sp. (strain R39))
TBA
Curated by ChEMBL
LigandPNGBDBM50337100((S)-1-(2-[(Phenylsulfonyl)amino]benzamido)ethanebo...)
Affinity DataIC50:  370nM. Assay description: Inhibition of Actinomadura R39 PBP after 60 mins
In DepthDetails ArticlePubMed