BDBM50337115 2'-((1R)-1-{(2R)-3-[1-(4-Chloro-3-fluorophenyl)-2-methylpropan-2-ylamino]-2-hydroxypropoxy}ethyl)biphenyl-4-carboxylic acid::CHEMBL1672971
SMILES C[C@@H](OC[C@H](O)CNC(C)(C)Cc1ccc(Cl)c(F)c1)c1ccccc1-c1ccc(cc1)C(O)=O
InChI Key InChIKey=SXIGLKXOASKLJP-XMSQKQJNSA-N
Data  1 IC50
  Tab Delimited (TSV)   2D SDfile   Computed 3D by Vconf -m prep SDfile
Find this compound or compounds like it in BindingDB:
Activity Spreadsheet -- Enzyme Inhibition Constant Data from BindingDB
Found 1 hit for monomerid = 50337115
TargetExtracellular calcium-sensing receptor(Homo sapiens (Human))
TBA
Curated by ChEMBL
LigandPNGBDBM50337115(2'-((1R)-1-{(2R)-3-[1-(4-Chloro-3-fluorophenyl)-2-...)
Affinity DataIC50:  23nM. Assay description: Antagonist activity at human CaSR expressed in rat PC12h cells by reporter gene assay
In DepthDetails ArticlePubMed