BDBM50337123 4-(((6-cyano-4'-methoxybiphenyl-3-yl)(4H-1,2,4-triazol-4-yl)amino)methyl)phenyl sulfamate::CHEMBL1672980
SMILES COc1ccc(cc1)-c1cc(ccc1C#N)N(Cc1ccc(OS(N)(=O)=O)cc1)n1cnnc1
InChI Key InChIKey=NGRUXADTVRQEHA-UHFFFAOYSA-N
Data  2 IC50
  Tab Delimited (TSV)   2D SDfile   Computed 3D by Vconf -m prep SDfile
Find this compound or compounds like it in BindingDB:
Activity Spreadsheet -- Enzyme Inhibition Constant Data from BindingDB
Found 2 hits for monomerid = 50337123
TargetSteryl-sulfatase(Homo sapiens (Human))
TBA
Curated by ChEMBL
LigandPNGBDBM50337123(4-(((6-cyano-4'-methoxybiphenyl-3-yl)(4H-1,2,4-tri...)
Affinity DataIC50:  22nM. Assay description: Inhibition of steroid sulfatase in human JEG-3 cells using [6,7-3H]E1S after 1 hr by scintillation spectrometry
In DepthDetails ArticlePubMed
TargetAromatase(Homo sapiens (Human))
TBA
Curated by ChEMBL
LigandPNGBDBM50337123(4-(((6-cyano-4'-methoxybiphenyl-3-yl)(4H-1,2,4-tri...)
Affinity DataIC50:  0.0150nM. Assay description: Inhibition of aromatase in human JEG-3 cells using [1beta-3H]androstenedione after 1 hr by scintillation spectrometry
In DepthDetails ArticlePubMed