BDBM50337303 1-(4-tert-butylbenzyl)-3-(3-(2-(2-hydroxy-2-(8-hydroxy-2-oxo-1,2-dihydroquinolin-5-yl)ethylamino)ethyl)phenyl)urea::CHEMBL1682302
SMILES CC(C)(C)c1ccc(CNC(=O)Nc2cccc(CCNCC(O)c3ccc(O)c4[nH]c(=O)ccc34)c2)cc1
InChI Key InChIKey=ATRBONUNFPTUTO-UHFFFAOYSA-N
Data  1 EC50
  Tab Delimited (TSV)   2D SDfile   Computed 3D by Vconf -m prep SDfile
Find this compound or compounds like it in BindingDB:
Activity Spreadsheet -- Enzyme Inhibition Constant Data from BindingDB
Found 1 hit for monomerid = 50337303
TargetBeta-2 adrenergic receptor(GUINEA PIG)
RhôNe-Poulenc Rorer
Curated by ChEMBL
LigandPNGBDBM50337303(1-(4-tert-butylbenzyl)-3-(3-(2-(2-hydroxy-2-(8-hyd...)
Affinity DataEC50:  0.900nM. Assay description: Agonist activity at beta2 adrenoreceptor in guinea pig tracheal rings assessed as vasorelaxation
In DepthDetails ArticlePubMed