BDBM50337360 CHEMBL1682390::Curculactone A
SMILES COc1cc(ccc1O)[C@H]1CC(=O)O[C@H]1C
InChI Key InChIKey=XHYNCDRUCNAFEB-CBAPKCEASA-N
Data  1 IC50
  Tab Delimited (TSV)   2D SDfile   Computed 3D by Vconf -m prep SDfile
Find this compound or compounds like it in BindingDB:
Activity Spreadsheet -- Enzyme Inhibition Constant Data from BindingDB
Found 1 hit for monomerid = 50337360
TargetPancreatic triacylglycerol lipase(Sus scrofa (Pig))
Daegu Haany University
Curated by ChEMBL
LigandPNGBDBM50337360(CHEMBL1682390 | Curculactone A)
Affinity DataIC50:  2.32E+5nM. Assay description: Inhibition of pig pancreatic lipase assessed as p-NPB hydrolysis by ELISA
In DepthDetails ArticlePubMed