BDBM50337363 CHEMBL1682392::threo-1-(3-methoxy-4-hydroxy-phenyl)-propan-1,2-diol
SMILES COc1cc(ccc1O)[C@H](O)[C@H](C)O
InChI Key InChIKey=PZKYCBMLUGVAGH-QUBYGPBYSA-N
Data  1 IC50
  Tab Delimited (TSV)   2D SDfile   Computed 3D by Vconf -m prep SDfile
Find this compound or compounds like it in BindingDB:
Activity Spreadsheet -- Enzyme Inhibition Constant Data from BindingDB
Found 1 hit for monomerid = 50337363
TargetPancreatic triacylglycerol lipase(Sus scrofa (Pig))
Daegu Haany University
Curated by ChEMBL
LigandPNGBDBM50337363(CHEMBL1682392 | threo-1-(3-methoxy-4-hydroxy-pheny...)
Affinity DataIC50:  9.10E+3nM. Assay description: Inhibition of pig pancreatic lipase assessed as p-NPB hydrolysis by ELISA
In DepthDetails ArticlePubMed