BDBM50337385 5-(1-(1-benzylpyrrolidin-3-yl)-4-(4-fluorophenyl)-1H-imidazol-5-yl)-1H-indazole::CHEMBL1682560
SMILES Fc1ccc(cc1)-c1ncn(C2CCN(Cc3ccccc3)C2)c1-c1ccc2[nH]ncc2c1
InChI Key InChIKey=PJNPAVYZHHPABL-UHFFFAOYSA-N
Data  8 KI
  Tab Delimited (TSV)   2D SDfile   Computed 3D by Vconf -m prep SDfile
Find this compound or compounds like it in BindingDB:
Activity Spreadsheet -- Enzyme Inhibition Constant Data from BindingDB
Found 8 hits for monomerid = 50337385
TargetEpidermal growth factor receptor(Homo sapiens (Human))
Abbott Laboratories
Curated by ChEMBL
LigandPNGBDBM50337385(5-(1-(1-benzylpyrrolidin-3-yl)-4-(4-fluorophenyl)-...)
Affinity DataKi:  8nM. Assay description: Inhibition of EGFR
In DepthDetails ArticlePubMed
TargetTyrosine-protein kinase JAK2(Homo sapiens (Human))
Abbott Laboratories
Curated by ChEMBL
LigandPNGBDBM50337385(5-(1-(1-benzylpyrrolidin-3-yl)-4-(4-fluorophenyl)-...)
Affinity DataKi: >1.45E+3nM. Assay description: Inhibition of JAK2
In DepthDetails ArticlePubMed
TargetSerine/threonine-protein kinase PAK 4(Homo sapiens (Human))
Abbott Laboratories
Curated by ChEMBL
LigandPNGBDBM50337385(5-(1-(1-benzylpyrrolidin-3-yl)-4-(4-fluorophenyl)-...)
Affinity DataKi: >3.75E+3nM. Assay description: Inhibition of Pak4
In DepthDetails ArticlePubMed
TargetAurora kinase B(Homo sapiens (Human))
Abbott Laboratories
Curated by ChEMBL
LigandPNGBDBM50337385(5-(1-(1-benzylpyrrolidin-3-yl)-4-(4-fluorophenyl)-...)
Affinity DataKi: >4.90E+3nM. Assay description: Inhibition of aurora 2
In DepthDetails ArticlePubMed
TargetGlycogen synthase kinase-3 beta(Homo sapiens (Human))
Abbott Laboratories
Curated by ChEMBL
LigandPNGBDBM50337385(5-(1-(1-benzylpyrrolidin-3-yl)-4-(4-fluorophenyl)-...)
Affinity DataKi: >5.45E+3nM. Assay description: Inhibition of GSK3-beta
In DepthDetails ArticlePubMed
TargetRho-associated protein kinase 2(Homo sapiens (Human))
Abbott Laboratories
Curated by ChEMBL
LigandPNGBDBM50337385(5-(1-(1-benzylpyrrolidin-3-yl)-4-(4-fluorophenyl)-...)
Affinity DataKi: >6.00E+3nM. Assay description: Inhibition of Rock2
In DepthDetails ArticlePubMed
TargetSerine/threonine-protein kinase pim-1(Homo sapiens (Human))
Abbott Laboratories
Curated by ChEMBL
LigandPNGBDBM50337385(5-(1-(1-benzylpyrrolidin-3-yl)-4-(4-fluorophenyl)-...)
Affinity DataKi: >8.75E+3nM. Assay description: Inhibition of Pim1
In DepthDetails ArticlePubMed
TargetVascular endothelial growth factor receptor 2(Homo sapiens (Human))
Abbott Laboratories
Curated by ChEMBL
LigandPNGBDBM50337385(5-(1-(1-benzylpyrrolidin-3-yl)-4-(4-fluorophenyl)-...)
Affinity DataKi: >8.88E+3nM. Assay description: Inhibition of KDR
In DepthDetails ArticlePubMed