BDBM50337401 (1S,2R)-N-benzyl-1-(3,4-dichlorophenyl)-N-methyl-2-((4-(N-methylacetamido)-4-phenylpiperidin-1-yl)methyl)cyclopropanecarboxamide::CHEMBL1682666
SMILES CN(Cc1ccccc1)C(=O)[C@]1(C[C@H]1CN1CCC(CC1)(N(C)C(C)=O)c1ccccc1)c1ccc(Cl)c(Cl)c1
InChI Key InChIKey=BAOSJUSHNIOEOW-QPQHGXMVSA-N
Data  1 KI
  Tab Delimited (TSV)   2D SDfile   Computed 3D by Vconf -m prep SDfile
Find this compound or compounds like it in BindingDB:
Activity Spreadsheet -- Enzyme Inhibition Constant Data from BindingDB
Found 1 hit for monomerid = 50337401
TargetNeuromedin-K receptor(Homo sapiens (Human))
H. Lundbeck
Curated by ChEMBL
LigandPNGBDBM50337401((1S,2R)-N-benzyl-1-(3,4-dichlorophenyl)-N-methyl-2...)
Affinity DataKi:  4.20nM. Assay description: Displacement of [3H]Lu AE93103 from human NK3 receptor expressed in BHK cells
In DepthDetails ArticlePubMed