BDBM50337701 CHEMBL1683313::N-isopropyl-3-(5-(4-(4-methylpiperazin-1-yl)phenyl)-1H-pyrazol-3-yl)benzamide
SMILES CC(C)NC(=O)c1cccc(c1)-c1cc([nH]n1)-c1ccc(cc1)N1CCN(C)CC1
InChI Key InChIKey=MGQVEANIPDCBLG-UHFFFAOYSA-N
Data  1 IC50
  Tab Delimited (TSV)   2D SDfile   Computed 3D by Vconf -m prep SDfile
Find this compound or compounds like it in BindingDB:
Activity Spreadsheet -- Enzyme Inhibition Constant Data from BindingDB
Found 1 hit for monomerid = 50337701
TargetSerine/threonine-protein kinase D1(Homo sapiens (Human))
Novartis Institutes For Biomedical Research
Curated by ChEMBL
LigandPNGBDBM50337701(CHEMBL1683313 | N-isopropyl-3-(5-(4-(4-methylpiper...)
Affinity DataIC50:  1.00E+3nM. Assay description: Inhibition of human PKD1 by TR-FRET assay
In DepthDetails ArticlePubMed