BDBM50337714 CHEMBL1683311::N-isopropyl-3-(5-(4-((2-methoxyethylamino)methyl)phenyl)-1H-pyrazol-3-yl)benzamide
SMILES COCCNCc1ccc(cc1)-c1cc([nH]n1)-c1cccc(c1)C(=O)NC(C)C
InChI Key InChIKey=VLOSSXXCPIINIB-UHFFFAOYSA-N
Data  1 IC50
  Tab Delimited (TSV)   2D SDfile   Computed 3D by Vconf -m prep SDfile
Find this compound or compounds like it in BindingDB:
Activity Spreadsheet -- Enzyme Inhibition Constant Data from BindingDB
Found 1 hit for monomerid = 50337714
TargetSerine/threonine-protein kinase D1(Homo sapiens (Human))
Novartis Institutes For Biomedical Research
Curated by ChEMBL
LigandPNGBDBM50337714(CHEMBL1683311 | N-isopropyl-3-(5-(4-((2-methoxyeth...)
Affinity DataIC50:  430nM. Assay description: Inhibition of human PKD1 by TR-FRET assay
In DepthDetails ArticlePubMed